{"text_format":"1","workbook":"xlsx","n_sheets":13,"sheets":["Setup","DA 1) Application & attachments","DA 2) Configuration","DA 3) Vehicle Details","DA 4) Design Rules","DA 5) Assessment","REPORT","Vehicle Approval application","Lists","Identical-Footprint","Variation Amend Info","Template Info","Change Log"],"not_rendered":{"charts":0,"images":6,"macros":1,"external_links":1,"defined_names":3740,"comments":0,"pivot_tables":0},"unopened":[],"bounds":{"document_bytes":16777216,"sheet_cells":100000,"rows_first":2000,"rows_last":500,"rows_between":2000,"halvings":0,"cell_chars":16384,"cell_head_chars":4096},"cells_cut":0,"cells_raw":0,"read":"whole","date_system":"1900"}

{"sheet":"Setup","index":0,"n_rows":46,"n_cols":8,"rows_kept":46,"cut":false,"hidden":false,"merged":[]}
[null,{"$f":"warningText","v":""}]
[]
[null,"                       Setup instructions"]
[]
[]
[]
[null,"Step 1"]
[null,"Visit the NHVR Developer Portal to obtain an API subscription key:",null,null,{"$f":"developerPortalUrl","v":"https://api-portal.nhvr.gov.au"}]
[]
[]
[null,"Step 2"]
[null,"Enter the 'API subscription key' into the box below and click 'Save API Key'."]
[null,"API Subscription Key"]
[null,"***************"]
[]
{"$rows_left_out":32}
{"sheet":"DA 1) Application & attachments","index":1,"n_rows":58,"n_cols":10,"rows_kept":58,"cut":false,"hidden":false,"merged":[[103,1,103,3],[104,1,104,3],[105,1,105,3],[106,1,106,3],[107,1,107,3],[98,1,98,3],[99,1,99,3],[100,1,100,3],[101,1,101,3],[102,1,102,3],[93,1,93,3],[94,1,94,3],[95,1,95,3],[96,1,96,3],[97,1,97,3],[88,1,88,3],[89,1,89,3],[90,1,90,3],[91,1,91,3],[92,1,92,3],[83,1,83,3],[84,1,84,3],[85,1,85,3],[86,1,86,3],[87,1,87,3],[78,1,78,3],[79,1,79,3],[80,1,80,3],[81,1,81,3],[82,1,82,3],[73,1,73,3],[74,1,74,3],[75,1,75,3],[76,1,76,3],[77,1,77,3],[41,5,41,7],[42,5,115,7],[58,1,62,3],[42,9,115,11],[108,1,108,3],[57,1,57,3],[63,1,63,3],[64,1,64,3],[65,1,65,3],[66,1,66,3],[67,1,67,3],[68,1,68,3],[69,1,69,3],[70,1,70,3],[71,1,71,3],[72,1,72,3]]}
[null,{"$f":"warningText","v":""}]
[]
[null,"                     DA 1) Application Details & Attachments"]
[]
[]
[null,"Assessor details",null,null,null,"Application details"]
[]
[null,"Assessor Name  (required)",null,"Accreditation Number (required) digits only","pbsCertifierId (hide field)","Application Nickname",null,"Application Id",null,"Application Type"]
[null,null,null,{"$f":"IFERROR(VLOOKUP(B9,pbsAssessor[],2,FALSE), \"\")","v":""},{"$f":"IFERROR(VLOOKUP(B9,pbsAssessor[],3,FALSE), \"\")","v":""},"",null,null,null,"Design Approval"]
[]
[null,"Applicant details"]
[]
[null,"ABN  (required - 11 digits)"]
[]
[null,"Company name (required)",null,"",null,"Applicant type (required)\nSelect from dropdown menu",null,""]
{"$rows_left_out":44}
{"sheet":"DA 2) Configuration","index":2,"n_rows":148,"n_cols":11,"rows_kept":148,"cut":false,"hidden":false,"merged":[]}
[null,{"$f":"warningText","v":""}]
[]
[null,"                     DA 2) Configuration"]
[]
[]
[]
[null,"Application Nickname",null,"Application Id"]
[null,{"$f":"IF(LEN('DA 1) Application & attachments'!name) > 0, 'DA 1) Application & attachments'!name, \"\")","v":""},{"$f":"IFERROR(VLOOKUP(#REF!,pbsAssessor[],3,FALSE), \"\")","v":""},{"$f":"'DA 1) Application & attachments'!id","v":0},null,"Design Approval"]
[]
[null,"Configuration (Combination)"]
[null,"Vehicle configuration (required)",null,"Max Length (required)","Max Width (required)","Max Height (required)"]
[null,"Rigid-truck and dog",null,18900,2500,4300]
[null,{"$f":"IFERROR(VLOOKUP(B12,vehicleComponentSetTypes[],3,FALSE), \"\")","v":38}]
[]
[null,"Components (Units)"]
{"$rows_left_out":134}
{"sheet":"DA 3) Vehicle Details","index":3,"n_rows":126,"n_cols":58,"rows_kept":126,"cut":false,"hidden":false,"merged":[[125,54,125,55],[125,12,125,13],[125,19,125,20],[125,26,125,27],[125,33,125,34],[125,40,125,41],[125,47,125,48],[125,5,125,6],[33,5,33,6],[35,5,35,6],[33,12,33,13],[35,12,35,13],[121,5,121,6],[122,5,122,6],[123,5,123,6],[124,5,124,6],[121,12,121,13],[122,12,122,13],[123,12,123,13],[124,12,124,13],[105,12,105,13],[106,12,106,13],[121,26,121,27],[122,26,122,27],[123,26,123,27],[124,26,124,27],[121,19,121,20],[122,19,122,20],[123,19,123,20],[124,19,124,20],[33,54,33,55],[35,19,35,20],[35,26,35,27],[35,33,35,34],[35,40,35,41],[35,47,35,48],[35,54,35,55],[33,19,33,20],[33,26,33,27],[33,33,33,34],[33,40,33,41],[33,47,33,48],[105,54,105,55],[106,54,106,55],[107,54,107,55],[108,54,108,55],[109,54,109,55],[121,33,121,34],[122,33,122,34],[123,33,123,34],[124,33,124,34],[121,54,121,55],[122,54,122,55],[123,54,123,55],[124,54,124,55],[121,47,121,48],[122,47,122,48],[123,47,123,48],[124,47,124,48],[121,40,121,41],[122,40,122,41],[123,40,123,41],[124,40,124,41],[105,40,105,41],[106,40,106,41],[107,40,107,41],[108,40,108,41],[109,40,109,41],[105,47,105,48],[106,47,106,48],[107,47,107,48],[108,47,108,48],[109,47,109,48],[105,26,105,27],[106,26,106,27],[107,26,107,27],[108,26,108,27],[109,26,109,27],[105,33,105,34],[106,33,106,34],[107,33,107,34],[108,33,108,34],[109,33,109,34],[107,12,107,13],[108,12,108,13],[109,12,109,13],[105,5,105,6],[106,5,106,6],[107,5,107,6],[108,5,108,6],[109,5,109,6],[105,19,105,20],[106,19,106,20],[107,19,107,20],[108,19,108,20],[109,19,109,20],[90,47,90,48],[91,47,91,48],[92,47,92,48],[93,47,93,48],[94,47,94,48],[90,54,90,55],[91,54,91,55],[92,54,92,55],[93,54,93,55],[94,54,94,55],[94,33,94,34],[90,26,90,27],[91,26,91,27],[92,26,92,27],[93,26,93,27],[94,26,94,27],[90,40,90,41],[91,40,91,41],[92,40,92,41],[93,40,93,41],[90,33,90,34],[91,33,91,34],[92,33,92,34],[93,33,93,34],[78,26,78,27],[78,19,78,20],[78,12,78,13],[78,5,78,6],[94,40,94,41],[78,54,78,55],[78,47,78,48],[78,40,78,41],[78,33,78,34],[90,5,90,6],[91,5,91,6],[92,5,92,6],[93,5,93,6],[94,5,94,6],[90,12,90,13],[91,12,91,13],[92,12,92,13],[93,12,93,13],[94,12,94,13],[90,19,90,20],[91,19,91,20],[92,19,92,20],[93,19,93,20],[94,19,94,20]]}
[null,{"$f":"warningText","v":""}]
[]
[null,"                     DA 3) Vehicle Details"]
[]
[]
[]
[null,"Application Nickname",null,"Application Id"]
[null,{"$f":"IF(LEN('DA 1) Application & attachments'!name) > 0, 'DA 1) Application & attachments'!name, \"\")","v":""},{"$f":"IFERROR(VLOOKUP(#REF!,pbsAssessor[],3,FALSE), \"\")","v":""},{"$f":"'DA 1) Application & attachments'!id","v":0},null,"Design Approval"]
[]
[null,"{assessment: false,justification: '', products: []}"]
[null,null,null,"Vehicle component 1",null,null,null,null,null,null,"Vehicle component 2",null,null,null,null,null,null,"Vehicle component 3",null,null,null,null,null,null,"Vehicle component 4",null,null,null,null,null,null,"Vehicle component 5",null,null,null,null,null,null,"Vehicle component 6",null,null,null,null,null,null,"Vehicle component 7",null,null,null,null,null,null,"Vehicle component 8"]
[null,null,null,{"$f":"IF(LEN('DA 2) Configuration'!D$17) > 0, 'DA 2) Configuration'!D$17, \"\")","v":"(required)"},null,null,null,null,null,null,{"$f":"IF(LEN('DA 2) Configuration'!E$17) > 0, 'DA 2) Configuration'!E$17, \"\")","v":"(required)"},null,null,null,null,null,null,{"$f":"IF(LEN('DA 2) Configuration'!F$17) > 0, 'DA 2) Configuration'!F$17, \"\")","v":""},null,null,null,null,null,null,{"$f":"IF(LEN('DA 2) Configuration'!G$17) > 0, 'DA 2) Configuration'!G$17, \"\")","v":""},null,null,null,null,null,null,{"$f":"IF(LEN('DA 2) Configuration'!H$17) > 0, 'DA 2) Configuration'!H$17, \"\")","v":""},null,null,null,null,null,null,{"$f":"IF(LEN('DA 2) Configuration'!I$17) > 0, 'DA 2) Configuration'!I$17, \"\")","v":""},null,null,null,null,null,null,{"$f":"IF(LEN('DA 2) Configuration'!J$17) > 0, 'DA 2) Configuration'!J$17, \"\")","v":""},null,null,null,null,null,null,{"$f":"IF(LEN('DA 2) Configuration'!K$17) > 0, 'DA 2) Configuration'!K$17, \"\")","v":""}]
[null,null,null,{"$f":"IF(LEN('DA 2) Configuration'!D$18) > 0, 'DA 2) Configuration'!D$18, \"\")","v":"Rigid truck long bonnet 1-2 axle"},null,null,null,null,null,null,{"$f":"IF(LEN('DA 2) Configuration'!E$18) > 0, 'DA 2) Configuration'!E$18, \"\")","v":"Dog trailer 1-2 axle"},null,null,null,null,null,null,{"$f":"IF(LEN('DA 2) Configuration'!F$18) > 0, 'DA 2) Configuration'!F$18, \"\")","v":""},null,null,null,null,null,null,{"$f":"IF(LEN('DA 2) Configuration'!GY$18) > 0, 'DA 2) Configuration'!G$18, \"\")","v":""},null,null,null,null,null,null,{"$f":"IF(LEN('DA 2) Configuration'!H$18) > 0, 'DA 2) Configuration'!H$18, \"\")","v":""},null,null,null,null,null,null,{"$f":"IF(LEN('DA 2) Configuration'!I$18) > 0, 'DA 2) Configuration'!I$18, \"\")","v":""},null,null,null,null,null,null,{"$f":"IF(LEN('DA 2) Configuration'!J$18) > 0, 'DA 2) Configuration'!J$18, \"\")","v":""},null,null,null,null,null,null,{"$f":"IF(LEN('DA 2) Configuration'!K$18) > 0, 'DA 2) Configuration'!K$18, \"\")","v":""}]
[]
[null,"Vehicle units",null,"Make","Model",null,null,null,null,null,"Make","Model",null,null,null,null,null,"Make","Model",null,null,null,null,null,"Make","Model",null,null,null,null,null,"Make","Model",null,null,null,null,null,"Make","Model",null,null,null,null,null,"Make","Model",null,null,null,null,null,"Make","Model"]
{"$rows_left_out":112}
{"sheet":"DA 4) Design Rules","index":4,"n_rows":38,"n_cols":6,"rows_kept":38,"cut":false,"hidden":false,"merged":[[37,3,37,4],[39,3,39,4],[41,3,41,4],[43,3,43,4],[45,3,45,4]]}
[null,{"$f":"warningText","v":""}]
[]
[null,"                     DA 4) Design Rules","                     DA 4) Design Rules"]
[]
[]
[]
[null,null,"Application Nickname","Application Id"]
[null,null,{"$f":"IF(LEN('DA 1) Application & attachments'!name) > 0, 'DA 1) Application & attachments'!name, \"\")","v":""},{"$f":"'DA 1) Application & attachments'!id","v":0},null,"Design Approval"]
[]
[null,null,"Design Rules"]
[null,null,null,"Australian Design Rules - Exemptions"]
[null,{"$f":"IFERROR(VLOOKUP(C12,designRules[],2,FALSE), \"\")","v":1},"Rule 43, Clause 6.1.1 (Length – Motor vehicles)","Yes"]
[null,{"$f":"IFERROR(VLOOKUP(C13,designRules[],2,FALSE), \"\")","v":2},"Rule 43, Clause 6.2.1 (Length – Trailers)"]
[null,{"$f":"IFERROR(VLOOKUP(C14,designRules[],2,FALSE), \"\")","v":3},"Rule 43, Clause 6.2.3 (Rear overhang – Trailers)"]
[null,{"$f":"IFERROR(VLOOKUP(C15,designRules[],2,FALSE), \"\")","v":4},"Rule 43, Clause 6.2.4 (Height – Trailers)"]
{"$rows_left_out":24}
{"sheet":"DA 5) Assessment","index":5,"n_rows":149,"n_cols":25,"rows_kept":149,"cut":false,"hidden":false,"merged":[[144,3,144,4],[119,2,119,4],[120,2,124,4],[128,3,128,4],[130,3,130,4],[132,3,132,4],[134,3,134,4],[109,8,109,23],[21,9,21,23],[138,3,138,4],[140,3,140,4],[142,3,142,4],[12,9,12,23],[66,9,66,23],[75,9,75,23],[93,9,93,23],[102,9,102,23],[19,8,19,23],[28,8,28,23],[46,8,46,23],[55,8,55,23],[73,8,73,23],[82,8,82,23],[100,8,100,23],[48,9,48,23],[39,9,39,23]]}
[null,null,{"$f":"warningText","v":""}]
[]
[null,null,"                     DA 5) Assessment & Mass Tables"]
[]
[]
[]
[null,null,"Application Nickname","Application Id"]
[null,{"$f":"IFERROR(VLOOKUP(#REF!,pbsAssessor[],3,FALSE), \"\")","v":""},{"$f":"IF(LEN('DA 1) Application & attachments'!name) > 0, 'DA 1) Application & attachments'!name, \"\")","v":""},{"$f":"'DA 1) Application & attachments'!id","v":0},null,"Design Approval"]
[]
[null,null,"Assessment - Set 1"]
[null,null,"Performance Standard","Results and level",null,"Mass tables"]
[null,null,"GCM"]
[null,null,"Level",1,null,"Mass table 1",null,null,null,"Axle groups"]
[null,{"$f":"IFERROR(VLOOKUP(C14,technicalResults[],2,FALSE), \"\")","v":1},"Startability",24.5,null,"Mass Limit","Assess","Label","Total","#1","#2","#3","#4","#5","#6","#7","#8","#9","#10","#11","#12","#13","#14","#15","#16"]
[null,{"$f":"IFERROR(VLOOKUP(C15,technicalResults[],2,FALSE), \"\")","v":2},"Gradeability - Maximum grade",26.7,null,"GML","No","GML1",46.5,6.5,16.5,9,16.5]
{"$rows_left_out":135}
{"sheet":"REPORT","index":6,"n_rows":8,"n_cols":3,"rows_kept":8,"cut":false,"hidden":false,"merged":[]}
[null,{"$f":"warningText","v":""}]
[]
[null,"                         Submission report"]
[]
[]
[]
[null,"Errors"]
[null,"Column1","Message"]

{"sheet":"Vehicle Approval application","index":7,"n_rows":82,"n_cols":10,"rows_kept":82,"cut":false,"hidden":false,"merged":[[82,1,86,3],[41,5,41,7],[42,5,86,7],[42,9,86,11]]}
[null,{"$f":"warningText","v":""}]
[]
[null,"                     Vehicle Approval application"]
[]
[]
[null,"Certifier details",null,null,null,"Application details"]
[]
[null,"Certifier Name  (required)",null,"Accreditation Number (required) digits only","pbsCertifierId (hide field)","Application Nickname",null,"Application Id",null,"Application Type"]
[null,null,null,{"$f":"IFERROR(VLOOKUP(B9,pbsCertifier[],2,FALSE), \"\")","v":""},{"$f":"IFERROR(VLOOKUP(B9,pbsCertifier[],3,FALSE), \"\")","v":""},"",null,null,null,"Vehicle Approval"]
[]
[null,"Operator details"]
[]
[null,"ABN  (required - 11 digits)"]
[]
[null,"Company name (required)",null,""]
{"$rows_left_out":68}
{"sheet":"Lists","index":8,"n_rows":49,"n_cols":74,"rows_kept":49,"cut":false,"hidden":false,"merged":[]}
[null,{"$f":"warningText","v":""}]
[]
[null,"                         Data lists"]
[]
[]
[]
[null,"Certifiers",null,null,null,"Assessors",null,null,null,"Combination Types",null,"Hauling Units",null,"Towed Units",null,"Load Types",null,"Body Types",null,"Variation Summaries",null,"Accounts",null,null,null,"Design Rules",null,null,"Technical results",null,null,"Vehicle Configurations",null,null,null,"Vehicle Components 1",null,null,null,null,"Vehicle Components 2",null,null,null,null,"Vehicle Components 3",null,null,null,null,"Vehicle Components 4",null,null,null,null,"Vehicle Components 5",null,null,null,null,"Vehicle Components 6",null,null,null,null,"Vehicle Components 7",null,null,null,null,"Vehicle Components 8"]
[null,"Name","Number","Id",null,"Name","Number","Id",null,"Name",null,"Name",null,"Name",null,"Name",null,"Name",null,"Name",null,"Name","Number","Id",null,"Name","Id",null,"Name","Id",null,"Name","Parent","Id",null,"Name","# axle groups","# axles","Id",null,"Name","# axle groups","# axles","Id",null,"Name","# axle groups","# axles","Id",null,"Name","# axle groups","# axles","Id",null,"Name","# axle groups","# axles","Id",null,"Name","# axle groups","# axles","Id",null,"Name","# axle groups","# axles","Id",null,"Name","# axle groups","# axles","Id"]
[null,null,null,null,null,null,null,null,null,"Bus",null,"1-1",null,"2",null,"DG (Liquid)",null,"Compliant bus",null,"Adding new variant",null,"National Heavy Vehicle Regulator","customer",5873,null,"Rule 43, Clause 6.1.1 (Length – Motor vehicles)",1,null,"Startability",1,null,"B-Double",2,13,null,"Rigid truck long bonnet 1-1 axle",2,2,85,null,"Dog trailer 1-1 axle",2,2,38]
[null,null,null,null,null,null,null,null,null,"Rigid truck",null,"1-2",null,"3",null,"DG (Powder)",null,"Coach",null,"Tyre options updated",null,"TOLL TRANSPORT PTY. LIMITED","customer",2236,null,"Rule 43, Clause 6.2.1 (Length – Trailers)",2,null,"Gradeability - Maximum grade",2,null,"A doubles",6,21,null,"Rigid truck long bonnet 1-2 axle",2,3,86,null,"Dog trailer 1-2 axle",2,3,39]
[null,null,null,null,null,null,null,null,null,"Truck and pig",null,"1-3",null,"1-1",null,"Non-DG (Liquid)",null,"Tanker",null,"Payload heights updated",null,"BORAL TRANSPORT LIMITED","customer",1568,null,"Rule 43, Clause 6.2.3 (Rear overhang – Trailers)",3,null,"Gradeability - Speed on a 1% grade",3,null,"Rigid-truck and dog",37,38,null,"Rigid truck long bonnet 2-2 axle",2,4,87,null,"Dog trailer 1-3 axle",2,4,40]
[null,null,null,null,null,null,null,null,null,"Truck and dog",null,"2-2",null,"1-2",null,"Non-DG (Powder)",null,"Van/Curtainsider",null,"Payload dimensions updated",null,"ADR Compliance Services","provider",1,null,"Rule 43, Clause 6.2.4 (Height – Trailers)",4,null,"Acceleration capability",4,null,"Articulated Bus",3,52,null,"Rigid truck long bonnet 1-3 axle",2,4,88,null,"Dog trailer 2-3 axle",2,5,41]
[null,null,null,null,null,null,null,null,null,"Prime mover and semitrailer",null,"2-3",null,"1-3",null,"General Freight (Mixed Freight)",null,"Platform",null,"Updating FDR and Drive suspension",null,"BISITECNIKS PTY. LTD.","provider",2,null,"Rule 43, Clause 6.2.6 (Width – Trailers)",5,null,"Tracking Ability on a Straight Path",5,null,"Prime and Semi-trailer (Freight)",31,32,null,"Rigid truck long bonnet 2-3 axle",2,5,142,null,"Dog trailer 2-2 axle",2,4,126]
[null,null,null,null,null,null,null,null,null,"Prime mover and semitrailer - 2+ axle groups",null,null,null,"2-1",null,"General Freight (Uniform Density)",null,"Bin",null,"Other",null,"BTT ENGINEERING CONSULTING PTY LTD","provider",3,null,"Rule 43, Clause 6.2.2 (Drawbar length – Trailers)",6,null,"Low-Speed Swept Path",6,null,"B triples",6,20,null,"Rigid truck short bonnet 1-1 axle",2,2,212,null,"Dog trailer 3-3 axle",2,6,127]
[null,null,null,null,null,null,null,null,null,"A-Double",null,null,null,"2-2",null,"Hanging Loads",null,"Other",null,"Payload dimensions updated",null,"BUS & COACH SOLUTIONS PTY LTD","provider",4,null,"Rule 43, Clause 9.4 (Retractable axles)",7,null,"Frontal Swing - Maximum Frontal Swing",7,null,"Controlled Access Bus (CAB)",3,14,null,"Rigid truck short bonnet 1-2 axle",2,3,213,null,"Dog trailer 3-4 axle",2,7,128]
{"$rows_left_out":35}
{"sheet":"Identical-Footprint","index":9,"n_rows":28,"n_cols":5,"rows_kept":28,"cut":false,"hidden":false,"merged":[[7,2,7,11],[16,2,17,11],[24,3,24,4]]}
[]
[]
[null,null,"Identical-Footprint Combination"]
[]
[null,null,"Identical-Footprint means a combination with axle spacings identical to existing combinations."]
[null,null,"There is no tolerance for axle spacings - the new combination's axle spacings must be identical to the existing combinations."]
[null,null,"The overall length can vary provided it remains within the same length bracket - see Table 1."]
[null,null,"In summary, Identical-Footprint combinations must have the same dimensions except for FOH and ROH which can vary provided that the combination remains within the same length bracket as previously approved combinations."]
[]
[null,null,"Identical-Footprint vehicles can vary in specifications:"]
[null,null,null,"Different vehicle components, such as engines, tyres, and suspensions are permitted"]
[null,null,null,"Different bin and payload heights are permitted"]
[]
[null,null,"The VA number will not change if adding Identical-Footprint combinations."]
[null,null,"The existing access permits will not require updating as the VA number will remain the same. "]
{"$rows_left_out":14}
{"sheet":"Variation Amend Info","index":10,"n_rows":34,"n_cols":2,"rows_kept":34,"cut":false,"hidden":false,"merged":[]}
[]
[null,"What is Variation/ Amend?"]
[]
["·       Variation/ Amendment refers to PBS Design Approval modification number"]
["·     This information is specified on the Part B"]
[null,"For more information, refer to our Information Sheet 'PBS Design Approval modification process'"]
[]
[null,"Example - Variation 1"]
[]
[]
[]
[]
[]
[]
[]
{"$rows_left_out":20}
{"sheet":"Template Info","index":11,"n_rows":51,"n_cols":3,"rows_kept":51,"cut":false,"hidden":false,"merged":[]}
[]
[null,"INDEX"]
[]
[1,"Enable macros"]
[]
[2,"Turn on macro code"]
[]
[3,"Setup"]
[]
[4,"How to use this template"]
[]
[5,"Feedback"]
[]
[1,"Enable macros"]
[]
{"$rows_left_out":37}
{"sheet":"Change Log","index":12,"n_rows":22,"n_cols":7,"rows_kept":22,"cut":false,"hidden":false,"merged":[]}
[null,{"$f":"warningText","v":""}]
[]
[null,"                        Change Log"]
[null,{"$f":"\"PBS-Submission-Tool v\" & VLOOKUP(thisVersion, releaseTable[],1,FALSE)  & \" (\" &TEXT(VLOOKUP(thisVersion, releaseTable[],2,FALSE), \"dd-mmm-yy\") & \")\"","v":{"$error":"#N/A"}}]
[]
[]
[]
[null,"Release version","Release date","Release notes","Archive date","Archived","Download url"]
[null,"2.3.0","2021-09-25T10:07:00","Breaking change to support release 9.9.0 DA full feature form",null,false,"https://nhvrappsprod.blob.core.windows.net/policies/PBS-Submission-Tool-V2.3.0.xlsm"]
[null,"2.2.0","2021-07-22T10:07:00","Breaking change of VA applications - 'Transfer' split into 'Transfer to another company', 'Change of company name'","2021-09-25T10:07:00",true,"https://nhvrappsprod.blob.core.windows.net/policies/PBS-Submission-Tool-V2.2.0.xlsm"]
[null,"2.1.0","2021-03-31T10:07:00","Breaking change to PBS application schema - add requirement for designRules array to support future DA Smart Forms","2021-07-22T10:07:00",true,"https://nhvrappsprod.blob.core.windows.net/policies/PBS-Submission-Tool-V2.1.0.xlsm"]
[null,"2.0.0","2021-03-09T10:07:00","Breaking change to name of pbsAssessor and pbsCertifier endpoints; Fix adding 'V' or 'A' to variation/amendment numbers","2021-03-31T10:07:00",true,"https://nhvrappsprod.blob.core.windows.net/policies/PBS-Submission-Tool-V2.1.0.xlsm"]
[null,"1.9.0","2021-01-28T10:07:00","Add update check feature","2021-03-09T10:07:00",true,"https://nhvrappsprod.blob.core.windows.net/policies/PBS-Submission-Tool-V2.1.0.xlsm"]
[null,"1.8.0","2021-01-27T09:07:00","Update font to Calibri","2021-01-29T09:07:00",true,"https://nhvrappsprod.blob.core.windows.net/policies/PBS-Submission-Tool-V1.8.0.xlsm"]
[null,"1.7.0","2021-01-23T09:07:00","Add Body Types and data load feature","2021-01-29T09:07:00",true,"https://nhvrappsprod.blob.core.windows.net/policies/PBS-Submission-Tool-V1.7.0.xlsm"]
{"$rows_left_out":7}